Target
UDP-N-acetylenolpyruvoylglucosamine reductase
Ligand
BDBM50195566
Substrate
Meas. Tech.
ChEMBL_414256 (CHEMBL908330)
IC50
13000±n/a nM
Citation
 Gilbert, AMFailli, AShumsky, JYang, YSeverin, ASingh, GHu, WKeeney, DPetersen, PJKatz, AH Pyrazolidine-3,5-diones and 5-hydroxy-1H-pyrazol-3(2H)-ones, inhibitors of UDP-N-acetylenolpyruvyl glucosamine reductase. J Med Chem 49:6027-36 (2006)  
Target
Name:
UDP-N-acetylenolpyruvoylglucosamine reductase
Synonyms:
MURB_ECOLI UDP-N-acetylenolpyruvoylglucosamine reductase murB | yijB
Type:
Protein
Mol. Mass.:
37848.05
Organism:
Escherichia coli K-12 (Enterobacteria)
Description:
E. coli MurB
Residue:
342
  
Inhibitor
Name:
BDBM50195566
Synonyms:
1,2-bis(4-chlorophenyl)-4-(3,4-dichlorobenzoyl)-5-hydroxy-1,2-dihydropyrazol-3-one | CHEMBL384984
Type:
Small organic molecule
Emp. Form.:
C22H12Cl4N2O3
Mol. Mass.:
494.154
SMILES:
Oc1c(C(=O)c2ccc(Cl)c(Cl)c2)c(=O)n(-c2ccc(Cl)cc2)n1-c1ccc(Cl)cc1
: