Target
Peroxisome proliferator-activated receptor gamma
Ligand
BDBM50195708
Substrate
Meas. Tech.
ChEMBL_425030 (CHEMBL912551)
IC50
22±n/a nM
Citation
 Warshawsky, AMAlt, CABrozinick, JTHarkness, ARHawkins, EDHenry, JRMatthews, DPMiller, ARMisener, EAMontrose-Rafizadeh, CRhodes, GAShen, QVance, JAUdodong, UEWang, MZhang, TYZink, RW Synthesis and evaluation of aminomethyl dihydrocinnamates as a new class of PPAR ligands. Bioorg Med Chem Lett 16:6328-33 (2006)  
Target
Name:
Peroxisome proliferator-activated receptor gamma
Synonyms:
NR1C3 PPAR-gamma PPARG_HUMAN Peroxisome proliferator-activated receptor gamma (PPAR gamma) Peroxisome proliferator-activated receptor gamma (PPARĪ³) peroxisome proliferator-activated receptor gamma isoform 2
Type:
Nuclear Receptor
Mol. Mass.:
57613.46
Organism:
Homo sapiens (Human)
Description:
P37231
Residue:
505
  
Inhibitor
Name:
BDBM50195708
Synonyms:
3-(2-((isopropoxycarbonyl)methyl)-4-(2-(5-methyl-2-morpholinothiazol-4-yl)ethoxy)phenyl)propanoic acid | CHEMBL223351
Type:
Small organic molecule
Emp. Form.:
C24H33N3O6S
Mol. Mass.:
491.6
SMILES:
CC(C)OC(=O)NCc1cc(OCCc2nc(sc2C)N2CCOCC2)ccc1CCC(O)=O
: