Target
Peroxisome proliferator-activated receptor gamma
Ligand
BDBM50195707
Substrate
Meas. Tech.
ChEMBL_425030 (CHEMBL912551)
IC50
72±n/a nM
Citation
 Warshawsky, AMAlt, CABrozinick, JTHarkness, ARHawkins, EDHenry, JRMatthews, DPMiller, ARMisener, EAMontrose-Rafizadeh, CRhodes, GAShen, QVance, JAUdodong, UEWang, MZhang, TYZink, RW Synthesis and evaluation of aminomethyl dihydrocinnamates as a new class of PPAR ligands. Bioorg Med Chem Lett 16:6328-33 (2006)  
Target
Name:
Peroxisome proliferator-activated receptor gamma
Synonyms:
NR1C3 PPAR-gamma PPARG_HUMAN Peroxisome proliferator-activated receptor gamma (PPAR gamma) Peroxisome proliferator-activated receptor gamma (PPARĪ³) peroxisome proliferator-activated receptor gamma isoform 2
Type:
Nuclear Receptor
Mol. Mass.:
57613.46
Organism:
Homo sapiens (Human)
Description:
P37231
Residue:
505
  
Inhibitor
Name:
BDBM50195707
Synonyms:
3-(4-(2-(5-methyl-2-phenyloxazol-4-yl)ethoxy)-2-((phenylmethylsulfonamido)methyl)phenyl)propanoic acid | CHEMBL219773
Type:
Small organic molecule
Emp. Form.:
C29H30N2O6S
Mol. Mass.:
534.623
SMILES:
Cc1oc(nc1CCOc1ccc(CCC(O)=O)c(CNS(=O)(=O)Cc2ccccc2)c1)-c1ccccc1
: