Target
Peroxisome proliferator-activated receptor alpha
Ligand
BDBM50195713
Substrate
Meas. Tech.
ChEMBL_425034 (CHEMBL912555)
IC50
9940±n/a nM
Citation
 Warshawsky, AMAlt, CABrozinick, JTHarkness, ARHawkins, EDHenry, JRMatthews, DPMiller, ARMisener, EAMontrose-Rafizadeh, CRhodes, GAShen, QVance, JAUdodong, UEWang, MZhang, TYZink, RW Synthesis and evaluation of aminomethyl dihydrocinnamates as a new class of PPAR ligands. Bioorg Med Chem Lett 16:6328-33 (2006)  
Target
Name:
Peroxisome proliferator-activated receptor alpha
Synonyms:
NR1C1 PPAR PPAR-alpha PPARA_HUMAN Peroxisome proliferator-activated receptor | Peroxisome proliferator-activated receptor alpha (PPAR alpha)
Type:
Enzyme
Mol. Mass.:
52222.08
Organism:
Homo sapiens (Human)
Description:
Q07869
Residue:
468
  
Inhibitor
Name:
BDBM50195713
Synonyms:
3-(2-((isopropoxycarbonyl)methyl)-4-(2-(5-methyl-2-(4-(pyrimidin-2-yl)phenyl)oxazol-4-yl)ethoxy)phenyl)propanoic acid | CHEMBL223128
Type:
Small organic molecule
Emp. Form.:
C30H32N4O6
Mol. Mass.:
544.5983
SMILES:
CC(C)OC(=O)NCc1cc(OCCc2nc(oc2C)-c2ccc(cc2)-c2ncccn2)ccc1CCC(O)=O
: