Target
Peroxisome proliferator-activated receptor gamma
Ligand
BDBM28700
Substrate
Meas. Tech.
ChEMBL_425030 (CHEMBL912551)
IC50
>10000±n/a nM
Citation
 Warshawsky, AMAlt, CABrozinick, JTHarkness, ARHawkins, EDHenry, JRMatthews, DPMiller, ARMisener, EAMontrose-Rafizadeh, CRhodes, GAShen, QVance, JAUdodong, UEWang, MZhang, TYZink, RW Synthesis and evaluation of aminomethyl dihydrocinnamates as a new class of PPAR ligands. Bioorg Med Chem Lett 16:6328-33 (2006)  
Target
Name:
Peroxisome proliferator-activated receptor gamma
Synonyms:
NR1C3 PPAR-gamma PPARG_HUMAN Peroxisome proliferator-activated receptor gamma (PPAR gamma) Peroxisome proliferator-activated receptor gamma (PPARĪ³) peroxisome proliferator-activated receptor gamma isoform 2
Type:
Nuclear Receptor
Mol. Mass.:
57613.46
Organism:
Homo sapiens (Human)
Description:
P37231
Residue:
505
  
Inhibitor
Name:
BDBM28700
Synonyms:
2-(4-(4-Chlorobenzoyl)phenoxy)-2-methylpropionic acid CHEMBL981 FIBRICOR LF 153 procetofenic acid
Type:
Small organic molecule
Emp. Form.:
C17H15ClO4
Mol. Mass.:
318.752
SMILES:
CC(C)(Oc1ccc(cc1)C(=O)c1ccc(Cl)cc1)C(O)=O
: