Target
Acetylcholinesterase
Ligand
BDBM10693
Substrate
Meas. Tech.
ChEMBL_431877 (CHEMBL915960)
IC50
0.32±n/a nM
Citation
 Piazzi, LBelluti, FBisi, AGobbi, SRizzo, SBartolini, MAndrisano, VRecanatini, MRampa, A Cholinesterase inhibitors: SAR and enzyme inhibitory activity of 3-[omega-(benzylmethylamino)alkoxy]xanthen-9-ones. Bioorg Med Chem 15:575-85 (2006)  
Target
Name:
Acetylcholinesterase
Synonyms:
ACES_HUMAN Acetylcholinesterase (AChE) | Acetylcholinesterase (human AChE)
Type:
Enzyme
Mol. Mass.:
67792.70
Organism:
Homo sapiens (Human)
Description:
P22303
Residue:
614
  
Inhibitor
Name:
BDBM10693
Synonyms:
3-{[methyl({7-[(9-oxo-9H-xanthen-3-yl)oxy]heptyl})amino]methyl}phenyl N-methylcarbamate Xanthostigmine deriv. 2 | aminoalkoxyaryl deriv. 12b
Type:
Small organic molecule
Emp. Form.:
C30H34N2O5
Mol. Mass.:
502.6014
SMILES:
CNC(=O)Oc1cccc(CN(C)CCCCCCCOc2ccc3c(c2)oc2ccccc2c3=O)c1
: