Target
Disintegrin and metalloproteinase domain-containing protein 17
Ligand
BDBM50195907
Substrate
Meas. Tech.
ChEMBL_452969 (CHEMBL902114)
IC50
111±n/a nM
Citation
 Duan, JJChen, LLu, ZJiang, BAsakawa, NSheppeck, JELiu, RQCovington, MBPitts, WKim, SHDecicco, CP Discovery of low nanomolar non-hydroxamate inhibitors of tumor necrosis factor-alpha converting enzyme (TACE). Bioorg Med Chem Lett 17:266-71 (2006)  
Target
Name:
Disintegrin and metalloproteinase domain-containing protein 17
Synonyms:
A disintegrin and metalloproteinase domain 17 ADAM 17 Snake venom-like protease TNF-alpha-Converting Enzyme
Type:
Metalloprotease
Mol. Mass.:
12197.99
Organism:
Sus scrofa (pig)
Description:
Partially purified TACE was obtained from porcine spleen.
Residue:
112
  
Inhibitor
Name:
BDBM50195907
Synonyms:
CHEMBL392867 | N-[2-(2,2-dimethyl-propionyl)-6,8,10-trioxo-2,7,9-triaza-spiro[4.5]dec-4-yl]-4-(2-methyl-quinolin-4-ylmethoxy)-benzamide
Type:
Small organic molecule
Emp. Form.:
C30H31N5O6
Mol. Mass.:
557.597
SMILES:
Cc1cc(COc2ccc(cc2)C(=O)NC2CN(CC22C(=O)NC(=O)NC2=O)C(=O)C(C)(C)C)c2ccccc2n1
: