Target
Cholecystokinin receptor type A
Ligand
BDBM50196201
Substrate
Meas. Tech.
ChEMBL_418718 (CHEMBL913512)
Ki
>10000±n/a nM
Citation
 Allison, BDPhuong, VKMcAtee, LCRosen, MMorton, MPrendergast, CBarrett, TLagaud, GFreedman, JLi, LWu, XVenkatesan, HPippel, MWoods, CRizzolio, MCHack, MHoey, KDeng, XKing, CShankley, NPRabinowitz, MH Identification and optimization of anthranilic sulfonamides as novel, selective cholecystokinin-2 receptor antagonists. J Med Chem 49:6371-90 (2006)  
Target
Name:
Cholecystokinin receptor type A
Synonyms:
CCK-A receptor CCK1-R CCKAR_HUMAN Cholecystokinin receptor Cholecystokinin-1 Receptor
Type:
G Protein-Coupled Receptor (GPCR)
Mol. Mass.:
47859.34
Organism:
Homo sapiens (Human)
Description:
Stable expression of human CCK-1 receptors in HEK 293 cells.
Residue:
428
  
Inhibitor
Name:
BDBM50196201
Synonyms:
1-[2-[7-bromo(2,1,3-benzothiadiazol-4-ylsulfonyl)amino]-4-bromobenzoyl]-piperidine | CHEMBL267290
Type:
Small organic molecule
Emp. Form.:
C18H16Br2N4O3S2
Mol. Mass.:
560.283
SMILES:
Brc1ccc(C(=O)N2CCCCC2)c(NS(=O)(=O)c2ccc(Br)c3nsnc23)c1
: