Target
Bifunctional epoxide hydrolase 2
Ligand
BDBM50196656
Substrate
Meas. Tech.
ChEMBL_432026 (CHEMBL918225)
IC50
1.5±n/a nM
Citation
 Kim, IHNishi, KTsai, HJBradford, TKoda, YWatanabe, TMorisseau, CBlanchfield, JToth, IHammock, BD Design of bioavailable derivatives of 12-(3-adamantan-1-yl-ureido)dodecanoic acid, a potent inhibitor of the soluble epoxide hydrolase. Bioorg Med Chem 15:312-23 (2006)  
Target
Name:
Bifunctional epoxide hydrolase 2
Synonyms:
Cytosolic epoxide hydrolase 2 EPHX2 HYES_HUMAN Soluble epoxide hydrolase (sEH) | epoxide hydrolase 2, cytoplasmic
Type:
Enzyme
Mol. Mass.:
62613.07
Organism:
Homo sapiens (Human)
Description:
P34913
Residue:
555
  
Inhibitor
Name:
BDBM50196656
Synonyms:
12-(3-adamantan-1-yl-ureido)-dodecanoic acid adamantan-1-yl ester | CHEMBL390796
Type:
Small organic molecule
Emp. Form.:
C33H54N2O3
Mol. Mass.:
526.7935
SMILES:
O=C(CCCCCCCCCCCNC(=O)NC12CC3CC(CC(C3)C1)C2)OC12CC3CC(CC(C3)C1)C2
: