Target
Cyclin-dependent kinase 5 activator 1
Ligand
BDBM50197306
Substrate
Meas. Tech.
ChEMBL_432189 (CHEMBL904415)
IC50
16000±n/a nM
Citation
 Vandromme, LLegraverend, MKreimerman, SLozach, OMeijer, LGrierson, DS A Pd(0) based cross-coupling approach to the synthesis of 2-amidopurines and their evaluation as CDK inhibitors. Bioorg Med Chem 15:130-41 (2006)  
Target
Name:
Cyclin-dependent kinase 5 activator 1
Synonyms:
CDK5/p35 Cyclin-dependent kinase 5 regulatory subunit 1 | Cyclin-dependent kinase 5/CDK5 activator 1
Type:
Protein Complex
Mol. Mass.:
Description:
Components:
This complex has 2 components.
Component 1
Name:
Cyclin-dependent kinase 5
Synonyms:
CDK5 CDKN5 Cyclin-dependent kinase 5 (CDK5/ p25) Cyclin-dependent-like kinase 5 PSSALRE Tau protein kinase II catalytic subunit
Type:
Enzyme Subunit
Mol. Mass.:
33308.61
Organism:
Homo sapiens (Human)
Description:
Residue:
292
  
Component 2
Name:
Cyclin-dependent kinase 5 activator 1
Synonyms:
CD5R1_HUMAN CDK5R1 Cyclin-dependent kinase 5 (CDK5/p25) NCK5A p35
Type:
Enzyme Subunit
Mol. Mass.:
34077.43
Organism:
Homo sapiens (Human)
Description:
Q15078
Residue:
307
  
Inhibitor
Name:
BDBM50197306
Synonyms:
9-isopropyl-6-(2-methoxy-ethylamino)-9H-purine-2-carboxylic acid isobutylamide | CHEMBL387759
Type:
Small organic molecule
Emp. Form.:
C16H26N6O2
Mol. Mass.:
334.4166
SMILES:
COCCNc1nc(nc2n(cnc12)C(C)C)C(=O)NCC(C)C
: