Target
Prothrombin
Ligand
BDBM50197324
Substrate
Meas. Tech.
ChEMBL_432201 (CHEMBL904427)
IC50
>200000±n/a nM
Citation
 Miura, MSeki, NKoike, TIshihara, TNiimi, THirayama, FShigenaga, TSakai-Moritani, YTagawa, AKawasaki, TSakamoto, SOkada, MOhta, MTsukamoto, S Design, synthesis and biological activity of selective and orally available TF/FVIIa complex inhibitors containing non-amidine P1 ligands. Bioorg Med Chem 15:160-73 (2006)  
Target
Name:
Prothrombin
Synonyms:
Activation peptide fragment 1 Coagulation factor II Prothrombin precursor Thrombin heavy chain | Thrombin light chain
Type:
Protein
Mol. Mass.:
70029.57
Organism:
Homo sapiens (Human)
Description:
P00734
Residue:
622
  
Inhibitor
Name:
BDBM50197324
Synonyms:
4-({[(1S)-(aminocarbonyl)-3-methylbutyl]amino}-carbonyl)-2'-({[4-(aminomethyl)phenyl]amino}carbonyl)-4'-(methylamino)biphenyl-2-carboxylic acid | CHEMBL426187
Type:
Small organic molecule
Emp. Form.:
C29H33N5O5
Mol. Mass.:
531.6028
SMILES:
CNc1ccc(c(c1)C(=O)Nc1ccc(CN)cc1)-c1ccc(cc1C(O)=O)C(=O)N[C@@H](CC(C)C)C(N)=O
: