Target
Coagulation factor VII/Tissue factor
Ligand
BDBM50197339
Substrate
Meas. Tech.
ChEMBL_432199 (CHEMBL904425)
IC50
19000±n/a nM
Citation
 Miura, MSeki, NKoike, TIshihara, TNiimi, THirayama, FShigenaga, TSakai-Moritani, YTagawa, AKawasaki, TSakamoto, SOkada, MOhta, MTsukamoto, S Design, synthesis and biological activity of selective and orally available TF/FVIIa complex inhibitors containing non-amidine P1 ligands. Bioorg Med Chem 15:160-73 (2006)  
Target
Name:
Coagulation factor VII/Tissue factor
Synonyms:
Coagulation factor III/Factor VIIa (fVIIa) | Coagulation factor III/VII
Type:
Mol. Mass.:
Description:
ASSAY_ID of EBI is 69535
Components:
This complex has 2 components.
Component 1
Name:
Tissue factor
Synonyms:
CD_antigen=CD142 Coagulation factor VII/tissue factor TF Thromboplastin | Tissue factor
Type:
PROTEIN
Mol. Mass.:
33067.61
Organism:
Homo sapiens (Human)
Description:
ChEMBL_936735
Residue:
295
  
Component 2
Name:
Coagulation factor VII
Synonyms:
Eptacog alfa FA7_HUMAN Factor VIIa (fVIIa) SPCA serum prothrombin conversion accelerator
Type:
Enzyme
Mol. Mass.:
51599.89
Organism:
Homo sapiens (Human)
Description:
Residue:
466
  
Inhibitor
Name:
BDBM50197339
Synonyms:
2'-({[3-(aminocarbonyl)phenyl]amino}carbonyl)-4-{[(3-methylbutyl)amino]carbonyl}biphenyl-2-carboxylicacid | CHEMBL225322
Type:
Small organic molecule
Emp. Form.:
C27H27N3O5
Mol. Mass.:
473.5204
SMILES:
CC(C)CCNC(=O)c1ccc(c(c1)C(O)=O)-c1ccccc1C(=O)Nc1cccc(c1)C(N)=O
: