Target
Sodium-dependent dopamine transporter
Ligand
BDBM50197437
Substrate
Meas. Tech.
ChEMBL_432256 (CHEMBL914034)
IC50
0.4±n/a nM
Citation
 Pham-Huu, DPDeschamps, JRLiu, SMadras, BKMeltzer, PC Synthesis of 8-thiabicyclo[3.2.1]octanes and their binding affinity for the dopamine and serotonin transporters. Bioorg Med Chem 15:1067-82 (2006)  
Target
Name:
Sodium-dependent dopamine transporter
Synonyms:
DAT1 SC6A3_MACFA | SLC6A3
Type:
PROTEIN
Mol. Mass.:
68455.12
Organism:
Macaca fascicularis
Description:
ChEMBL_61362
Residue:
620
  
Inhibitor
Name:
BDBM50197437
Synonyms:
(1R,2S,3R)-methyl 3-(3,4-dichlorophenyl)-8-methyl-8-aza-bicyclo[3.2.1]octane-2-carboxylate | CHEMBL227538
Type:
Small organic molecule
Emp. Form.:
C16H19Cl2NO2
Mol. Mass.:
328.234
SMILES:
COC(=O)[C@@H]1[C@H]2CCC(C[C@H]1c1ccc(Cl)c(Cl)c1)N2C
: