Target
Neprilysin
Ligand
BDBM50190746
Substrate
Meas. Tech.
ChEMBL_432271 (CHEMBL914049)
pH
7±n/a
IC50
18.9±n/a nM
Comments
extracted
Citation
 Pryde, DCCook, ASBurring, DJJones, LHFoll, SPlatts, MYSanderson, VCorless, MStobie, AMiddleton, DSFoster, LBarker, LVan Der Graaf, PStacey, PKohl, CCoggon, SBeaumont, K Novel selective inhibitors of neutral endopeptidase for the treatment of female sexual arousal disorder. Bioorg Med Chem 15:142-59 (2006)  
Target
Name:
Neprilysin
Synonyms:
Atriopeptidase CD_antigen=CD10 EPN MME NEP_HUMAN Neutral endopeptidase | Neutral endopeptidase 24.11
Type:
Enzyme
Mol. Mass.:
85505.38
Organism:
Homo sapiens (Human)
Description:
P08473
Residue:
750
  
Inhibitor
Name:
BDBM50190746
Synonyms:
(R)-2-((1-((5-ethyl-1,3,4-thiadiazol-2-yl)carbamoyl)cyclopentyl)methyl)pentanoic acid R-2-[1-(5-ethyl-[1,3,4]thiadiazol-2-ylcarbamoyl)-cyclopentylmethyl]-pentanoic acid
Type:
Small organic molecule
Emp. Form.:
C16H25N3O3S
Mol. Mass.:
339.453
SMILES:
CCC[C@H](CC1(CCCC1)C(=O)Nc1nnc(CC)s1)C(O)=O
: