Target
Matrix metalloproteinase-14
Ligand
BDBM12072
Substrate
Meas. Tech.
ChEMBL_432509 (CHEMBL918803)
IC50
79±n/a nM
Citation
 Biasone, ATortorella, PCampestre, CAgamennone, MPreziuso, SChiappini, MNuti, ECarelli, PRossello, AMazza, FGallina, C alpha-Biphenylsulfonylamino 2-methylpropyl phosphonates: enantioselective synthesis and selective inhibition of MMPs. Bioorg Med Chem 15:791-9 (2006)  
Target
Name:
Matrix metalloproteinase-14
Synonyms:
MMP-14 MMP14 MT-MMP 1 MT1MMP Matrix Metalloproteinase-14 (MMP-14) Matrix metalloproteinase-14 Membrane-type matrix metalloproteinase 1 | Membrane-type-1 matrix metalloproteinase
Type:
Protein
Mol. Mass.:
65900.19
Organism:
Homo sapiens (Human)
Description:
P50281
Residue:
582
  
Inhibitor
Name:
BDBM12072
Synonyms:
(R)-[1-(4-Methoxybiphenyl-4-sulfonylamino)-2-methylpropyl]phosphonic Acid [(1R)-1-{[4-(4-methoxyphenyl)benzene]sulfonamido}-2-methylpropyl]phosphonic acid | alpha-arylsulfonylamino phosphonate 1R
Type:
Small organic molecule
Emp. Form.:
C17H22NO6PS
Mol. Mass.:
399.398
SMILES:
COc1ccc(cc1)-c1ccc(cc1)S(=O)(=O)N[C@@H](C(C)C)P(O)(O)=O
: