Target
Matrix metalloproteinase-9
Ligand
BDBM50198035
Substrate
Meas. Tech.
ChEMBL_432507 (CHEMBL918801)
IC50
64±n/a nM
Citation
 Biasone, ATortorella, PCampestre, CAgamennone, MPreziuso, SChiappini, MNuti, ECarelli, PRossello, AMazza, FGallina, C alpha-Biphenylsulfonylamino 2-methylpropyl phosphonates: enantioselective synthesis and selective inhibition of MMPs. Bioorg Med Chem 15:791-9 (2006)  
Target
Name:
Matrix metalloproteinase-9
Synonyms:
67 kDa matrix metalloproteinase-9 92 kDa gelatinase CLG4B Gelatinase B MMP9 Matrix metalloproteinase 9 (MMP-9) Matrix metalloproteinase-9 (MMP9)
Type:
Enzyme
Mol. Mass.:
78452.28
Organism:
Homo sapiens (Human)
Description:
P14780
Residue:
707
  
Inhibitor
Name:
BDBM50198035
Synonyms:
CHEMBL227501 | [(R)-2-methyl-1-(3'-methyl-biphenyl-4-sulfonylamino)-propyl]-phosphonic acid
Type:
Small organic molecule
Emp. Form.:
C17H22NO5PS
Mol. Mass.:
383.399
SMILES:
CC(C)[C@H](NS(=O)(=O)c1ccc(cc1)-c1cccc(C)c1)P(O)(O)=O
: