Target
72 kDa type IV collagenase
Ligand
BDBM50198031
Substrate
Meas. Tech.
ChEMBL_432503 (CHEMBL918797)
IC50
1.8±n/a nM
Citation
 Biasone, ATortorella, PCampestre, CAgamennone, MPreziuso, SChiappini, MNuti, ECarelli, PRossello, AMazza, FGallina, C alpha-Biphenylsulfonylamino 2-methylpropyl phosphonates: enantioselective synthesis and selective inhibition of MMPs. Bioorg Med Chem 15:791-9 (2006)  
Target
Name:
72 kDa type IV collagenase
Synonyms:
72 kDa gelatinase CLG4A Gelatinase A (MMP-2) MMP2_HUMAN Matrix metalloproteinase-2 (MMP 2) Matrix metalloproteinases 2 (MMP-2) | TBE-1
Type:
Enzyme
Mol. Mass.:
73870.36
Organism:
Homo sapiens (Human)
Description:
P08253
Residue:
660
  
Inhibitor
Name:
BDBM50198031
Synonyms:
CHEMBL227598 | [(R)-1-(4'-isopropoxy-biphenyl-4-sulfonylamino)-2-methyl-propyl]-phosphonic acid
Type:
Small organic molecule
Emp. Form.:
C19H26NO6PS
Mol. Mass.:
427.452
SMILES:
CC(C)Oc1ccc(cc1)-c1ccc(cc1)S(=O)(=O)N[C@@H](C(C)C)P(O)(O)=O
: