Target
Neutrophil collagenase
Ligand
BDBM50198033
Substrate
Meas. Tech.
ChEMBL_432506 (CHEMBL918800)
IC50
0.390000±n/a nM
Citation
 Biasone, ATortorella, PCampestre, CAgamennone, MPreziuso, SChiappini, MNuti, ECarelli, PRossello, AMazza, FGallina, C alpha-Biphenylsulfonylamino 2-methylpropyl phosphonates: enantioselective synthesis and selective inhibition of MMPs. Bioorg Med Chem 15:791-9 (2006)  
Target
Name:
Neutrophil collagenase
Synonyms:
CLG1 MMP8 Matrix metalloproteinase-8 PMNL collagenase | PMNL-CL
Type:
Enzyme
Mol. Mass.:
53413.48
Organism:
Homo sapiens (Human)
Description:
P22894
Residue:
467
  
Inhibitor
Name:
BDBM50198033
Synonyms:
CHEMBL227484 | [(R)-2-methyl-1-(4'-methyl-biphenyl-4-sulfonylamino)-propyl]-phosphonic acid
Type:
Small organic molecule
Emp. Form.:
C17H22NO5PS
Mol. Mass.:
383.399
SMILES:
CC(C)[C@H](NS(=O)(=O)c1ccc(cc1)-c1ccc(C)cc1)P(O)(O)=O
: