Target
Neutrophil collagenase
Ligand
BDBM50198034
Substrate
Meas. Tech.
ChEMBL_432506 (CHEMBL918800)
IC50
0.810000±n/a nM
Citation
 Biasone, ATortorella, PCampestre, CAgamennone, MPreziuso, SChiappini, MNuti, ECarelli, PRossello, AMazza, FGallina, C alpha-Biphenylsulfonylamino 2-methylpropyl phosphonates: enantioselective synthesis and selective inhibition of MMPs. Bioorg Med Chem 15:791-9 (2006)  
Target
Name:
Neutrophil collagenase
Synonyms:
CLG1 MMP8 Matrix metalloproteinase-8 PMNL collagenase | PMNL-CL
Type:
Enzyme
Mol. Mass.:
53413.48
Organism:
Homo sapiens (Human)
Description:
P22894
Residue:
467
  
Inhibitor
Name:
BDBM50198034
Synonyms:
CHEMBL376557 | [(R)-1-(4'-chloro-biphenyl-4-sulfonylamino)-2-methyl-propyl]-phosphonic acid
Type:
Small organic molecule
Emp. Form.:
C16H19ClNO5PS
Mol. Mass.:
403.818
SMILES:
CC(C)[C@H](NS(=O)(=O)c1ccc(cc1)-c1ccc(Cl)cc1)P(O)(O)=O
: