Target
Sodium-dependent dopamine transporter
Ligand
BDBM50198232
Substrate
Meas. Tech.
ChEMBL_453326 (CHEMBL901476)
Ki
740±n/a nM
Citation
 Tamagnan, GDBrenner, EAlagille, DStaley, JKHaile, CKoren, AEarly, MBaldwin, RMTarazi, FIBaldessarini, RJJarkas, NGoodman, MMSeibyl, JP Development of SPECT imaging agents for the norepinephrine transporters: [123I]INER. Bioorg Med Chem Lett 17:533-7 (2007)  
Target
Name:
Sodium-dependent dopamine transporter
Synonyms:
DA transporter SC6A3_RAT Sodium-dependent dopamine transporter | Sodium-dependent dopamine transporter (DAT)
Type:
Multi-pass membrane protein
Mol. Mass.:
68749.45
Organism:
Rattus norvegicus (rat)
Description:
P23977
Residue:
619
  
Inhibitor
Name:
BDBM50198232
Synonyms:
2-((3-iodophenyl)(o-tolyloxy)methyl)morpholine | CHEMBL439030
Type:
Small organic molecule
Emp. Form.:
C18H20INO2
Mol. Mass.:
409.2614
SMILES:
Cc1ccccc1OC(C1CNCCO1)c1cccc(I)c1
: