Target
C-X-C chemokine receptor type 3
Ligand
BDBM50198410
Substrate
Meas. Tech.
ChEMBL_437683 (CHEMBL905958)
Ki
70±n/a nM
Citation
 Allen, DRBolt, AChapman, GAKnight, RLMeissner, JWOwen, DAWatson, RJ Identification and structure-activity relationships of 1-aryl-3-piperidin-4-yl-urea derivatives as CXCR3 receptor antagonists. Bioorg Med Chem Lett 17:697-701 (2007)  
Target
Name:
C-X-C chemokine receptor type 3
Synonyms:
AAO92295.1 C-X-C chemokine receptor type 3 (CXCR3) CXCR3 CXCR3_HUMAN chemokine (C-X-C motif) receptor 3
Type:
Enzyme Catalytic Domain
Mol. Mass.:
40665.65
Organism:
Homo sapiens (Human)
Description:
Residue:
368
  
Inhibitor
Name:
BDBM50198410
Synonyms:
1-(1-(((1R,5S)-6,6-dimethylbicyclo[3.1.1]hept-2-en-2-yl)methyl)piperidin-4-yl)-3-(5-(thiophen-2-yl)pyridin-3-yl)urea | CHEMBL244603
Type:
Small organic molecule
Emp. Form.:
C25H32N4OS
Mol. Mass.:
436.613
SMILES:
CC1(C)[C@@H]2C[C@H]1C(CN1CCC(CC1)NC(=O)Nc1cncc(c1)-c1cccs1)=CC2
: