Target
C-X-C chemokine receptor type 3
Ligand
BDBM50198418
Substrate
Meas. Tech.
ChEMBL_437683 (CHEMBL905958)
Ki
41±n/a nM
Citation
 Allen, DRBolt, AChapman, GAKnight, RLMeissner, JWOwen, DAWatson, RJ Identification and structure-activity relationships of 1-aryl-3-piperidin-4-yl-urea derivatives as CXCR3 receptor antagonists. Bioorg Med Chem Lett 17:697-701 (2007)  
Target
Name:
C-X-C chemokine receptor type 3
Synonyms:
AAO92295.1 C-X-C chemokine receptor type 3 (CXCR3) CXCR3 CXCR3_HUMAN chemokine (C-X-C motif) receptor 3
Type:
Enzyme Catalytic Domain
Mol. Mass.:
40665.65
Organism:
Homo sapiens (Human)
Description:
Residue:
368
  
Inhibitor
Name:
BDBM50198418
Synonyms:
1-(1-(cyclooctenylmethyl)piperidin-4-yl)-3-(3,5-dichlorophenyl)urea | CHEMBL243341
Type:
Small organic molecule
Emp. Form.:
C21H29Cl2N3O
Mol. Mass.:
410.38
SMILES:
Clc1cc(Cl)cc(NC(=O)NC2CCN(C\C3=C\CCCCCC3)CC2)c1
: