Target
Cannabinoid receptor 1
Ligand
BDBM50198516
Substrate
Meas. Tech.
ChEMBL_437693 (CHEMBL905968)
Ki
7.5±n/a nM
Citation
 Smith, RAFathi, ZBrown, SEChoi, SFan, JJenkins, SKluender, HCKonkar, ALavoie, RMays, RNatoli, JO'Connor, SJOrtiz, AAPodlogar, BTaing, CTomlinson, STritto, TZhang, Z Constrained analogs of CB-1 antagonists: 1,5,6,7-Tetrahydro-4H-pyrrolo[3,2-c]pyridine-4-one derivatives. Bioorg Med Chem Lett 17:673-8 (2007)  
Target
Name:
Cannabinoid receptor 1
Synonyms:
CANN6 CB-R CNR CNR1_HUMAN Cannabinoid receptor Cannabinoid receptor 1 (brain)
Type:
G Protein-Coupled Receptor (GPCR)
Mol. Mass.:
52868.96
Organism:
Homo sapiens (Human)
Description:
P21554
Residue:
472
  
Inhibitor
Name:
BDBM50198516
Synonyms:
1-(2-chlorophenyl)-5-cyclohexyl-2-(4-methoxyphenyl)-3-methyl-6,7-dihydro-1H-pyrrolo[3,2-c]pyridin-4(5H)-one | CHEMBL231096
Type:
Small organic molecule
Emp. Form.:
C27H29ClN2O2
Mol. Mass.:
448.984
SMILES:
COc1ccc(cc1)-c1c(C)c2c(CCN(C3CCCCC3)C2=O)n1-c1ccccc1Cl
: