Target
Melanin-concentrating hormone receptor 1
Ligand
BDBM50198572
Substrate
Meas. Tech.
ChEMBL_421484 (CHEMBL854913)
Ki
16000±n/a nM
Citation
 Meyers, KMMéndez-Andino, JLColson, AOWarshakoon, NCWos, JAMitchell, MCHodge, KMHoward, JMAckley, DCHolbert, JKMittelstadt, SWDowty, MEObringer, CMReizes, OHu, XE Aminomethyl tetrahydronaphthalene ketopiperazine MCH-R1 antagonists--Increasing selectivity over hERG. Bioorg Med Chem Lett 17:819-22 (2007)  
Target
Name:
Melanin-concentrating hormone receptor 1
Synonyms:
G-protein coupled receptor 24 MCH receptor 1 MCH-R1 MCHR-1 MCHR1_HUMAN Melanin-Concentrating Hormone Receptor 1 (MCH1R) Melanin-concentrating hormone receptor 1 (MCH-1) Melanin-concentrating hormone receptor 1 (MCHR-1) SLC-1 Somatostatin receptor-like protein
Type:
G Protein-Coupled Receptor (GPCR)
Mol. Mass.:
45976.27
Organism:
Homo sapiens (Human)
Description:
Membranes from CHO-K1 cells stably expressing human MCH1R were used in assays.
Residue:
422
  
Inhibitor
Name:
BDBM50198572
Synonyms:
(S)-1-(6-((4-acetylpiperazin-1-yl)methyl)-1,2,3,4-tetrahydronaphthalen-2-yl)-4-(4-fluorophenethyl)piperazin-2-one | CHEMBL386717
Type:
Small organic molecule
Emp. Form.:
C29H37FN4O2
Mol. Mass.:
492.6281
SMILES:
CC(=O)N1CCN(Cc2ccc3C[C@H](CCc3c2)N2CCN(CCc3ccc(F)cc3)CC2=O)CC1
: