Target
Melanin-concentrating hormone receptor 1
Ligand
BDBM50199243
Substrate
Meas. Tech.
ChEMBL_411789 (CHEMBL908945)
IC50
>10000±n/a nM
Citation
 Tavares, FXAl-Barazanji, KABishop, MJBritt, CSCarlton, DLCooper, JPFeldman, PLGarrido, DMGoetz, ASGrizzle, MKHertzog, DLIgnar, DMLang, DGMcIntyre, MSOtt, RJPeat, AJZhou, HQ 6-(4-chlorophenyl)-3-substituted-thieno[3,2-d]pyrimidin-4(3H)-one-based melanin-concentrating hormone receptor 1 antagonist. J Med Chem 49:7108-18 (2006)  
Target
Name:
Melanin-concentrating hormone receptor 1
Synonyms:
G-protein coupled receptor 24 MCH receptor 1 MCH-R1 MCHR-1 MCHR1_HUMAN Melanin-Concentrating Hormone Receptor 1 (MCH1R) Melanin-concentrating hormone receptor 1 (MCH-1) Melanin-concentrating hormone receptor 1 (MCHR-1) SLC-1 Somatostatin receptor-like protein
Type:
G Protein-Coupled Receptor (GPCR)
Mol. Mass.:
45976.27
Organism:
Homo sapiens (Human)
Description:
Membranes from CHO-K1 cells stably expressing human MCH1R were used in assays.
Residue:
422
  
Inhibitor
Name:
BDBM50199243
Synonyms:
6-[6-(4-chlorophenyl)-4-oxothieno[3,2-d]pyrimidin-3(4H)-yl]-2-naphthalenecarboxylic acid | CHEMBL410641
Type:
Small organic molecule
Emp. Form.:
C23H13ClN2O3S
Mol. Mass.:
432.879
SMILES:
OC(=O)c1ccc2cc(ccc2c1)-n1cnc2cc(sc2c1=O)-c1ccc(Cl)cc1
: