Target
Melanin-concentrating hormone receptor 1
Ligand
BDBM50199265
Substrate
Meas. Tech.
ChEMBL_411789 (CHEMBL908945)
IC50
1.4±n/a nM
Citation
 Tavares, FXAl-Barazanji, KABishop, MJBritt, CSCarlton, DLCooper, JPFeldman, PLGarrido, DMGoetz, ASGrizzle, MKHertzog, DLIgnar, DMLang, DGMcIntyre, MSOtt, RJPeat, AJZhou, HQ 6-(4-chlorophenyl)-3-substituted-thieno[3,2-d]pyrimidin-4(3H)-one-based melanin-concentrating hormone receptor 1 antagonist. J Med Chem 49:7108-18 (2006)  
Target
Name:
Melanin-concentrating hormone receptor 1
Synonyms:
G-protein coupled receptor 24 MCH receptor 1 MCH-R1 MCHR-1 MCHR1_HUMAN Melanin-Concentrating Hormone Receptor 1 (MCH1R) Melanin-concentrating hormone receptor 1 (MCH-1) Melanin-concentrating hormone receptor 1 (MCHR-1) SLC-1 Somatostatin receptor-like protein
Type:
G Protein-Coupled Receptor (GPCR)
Mol. Mass.:
45976.27
Organism:
Homo sapiens (Human)
Description:
Membranes from CHO-K1 cells stably expressing human MCH1R were used in assays.
Residue:
422
  
Inhibitor
Name:
BDBM50199265
Synonyms:
6-(4-chlorophenyl)-3-(2-{[(2R)-2-(methoxymethyl)pyrrolidin-1-yl]methyl}-1-methyl-1H-indol-5-yl)thieno[3,2-d]pyrimidin-4(3H)-one | CHEMBL217733
Type:
Small organic molecule
Emp. Form.:
C28H27ClN4O2S
Mol. Mass.:
519.058
SMILES:
COC[C@H]1CCCN1Cc1cc2cc(ccc2n1C)-n1cnc2cc(sc2c1=O)-c1ccc(Cl)cc1
: