Target
Glucagon receptor
Ligand
BDBM50199499
Substrate
Meas. Tech.
ChEMBL_441039 (CHEMBL890126)
IC50
189±n/a nM
Citation
 Liang, RAbrardo, LBrady, EJCandelore, MRDing, VSaperstein, RTota, LMWright, MMock, STamvakopolous, CTong, SZheng, SZhang, BBTata, JRParmee, ER Design and synthesis of conformationally constrained tri-substituted ureas as potent antagonists of the human glucagon receptor. Bioorg Med Chem Lett 17:587-92 (2007)  
Target
Name:
Glucagon receptor
Synonyms:
GCGR GLR_HUMAN Glucagon receptor (GlucR)
Type:
Enzyme
Mol. Mass.:
54026.92
Organism:
Homo sapiens (Human)
Description:
P47871
Residue:
477
  
Inhibitor
Name:
BDBM50199499
Synonyms:
3-(1-(1-(4-cyclohexylphenyl)-3-(4-(trifluoromethoxy)phenyl)ureido)-2,3-dihydro-1H-indene-5-carboxamido)propanoic acid | CHEMBL265337
Type:
Small organic molecule
Emp. Form.:
C33H34F3N3O5
Mol. Mass.:
609.6354
SMILES:
OC(=O)CCNC(=O)c1ccc2C(CCc2c1)N(C(=O)Nc1ccc(OC(F)(F)F)cc1)c1ccc(cc1)C1CCCCC1
: