Target
Gastric inhibitory polypeptide receptor
Ligand
BDBM50199488
Substrate
Meas. Tech.
ChEMBL_441040 (CHEMBL890127)
IC50
171±n/a nM
Citation
 Liang, RAbrardo, LBrady, EJCandelore, MRDing, VSaperstein, RTota, LMWright, MMock, STamvakopolous, CTong, SZheng, SZhang, BBTata, JRParmee, ER Design and synthesis of conformationally constrained tri-substituted ureas as potent antagonists of the human glucagon receptor. Bioorg Med Chem Lett 17:587-92 (2007)  
Target
Name:
Gastric inhibitory polypeptide receptor
Synonyms:
GIPR Gastric Inhibitory Polypeptide Receptor (GIPR) | Gastric inhibitory polypeptide receptor
Type:
PROTEIN
Mol. Mass.:
53173.82
Organism:
Homo sapiens (Human)
Description:
ChEMBL_1518286
Residue:
466
  
Inhibitor
Name:
BDBM50199488
Synonyms:
3-(1-(1-((1r,4r)-4-tert-butylcyclohexyl)-3-(4-(trifluoromethoxy)phenyl)ureido)-1,2,3,4-tetrahydronaphthalene-6-carboxamido)propanoic acid | CHEMBL232241
Type:
Small organic molecule
Emp. Form.:
C32H40F3N3O5
Mol. Mass.:
603.6723
SMILES:
CC(C)(C)[C@H]1CC[C@@H](CC1)N(C1CCCc2cc(ccc12)C(=O)NCCC(O)=O)C(=O)Nc1ccc(OC(F)(F)F)cc1
: