Target
Glucagon receptor
Ligand
BDBM50199490
Substrate
Meas. Tech.
ChEMBL_441039 (CHEMBL890126)
IC50
46±n/a nM
Citation
 Liang, RAbrardo, LBrady, EJCandelore, MRDing, VSaperstein, RTota, LMWright, MMock, STamvakopolous, CTong, SZheng, SZhang, BBTata, JRParmee, ER Design and synthesis of conformationally constrained tri-substituted ureas as potent antagonists of the human glucagon receptor. Bioorg Med Chem Lett 17:587-92 (2007)  
Target
Name:
Glucagon receptor
Synonyms:
GCGR GLR_HUMAN Glucagon receptor (GlucR)
Type:
Enzyme
Mol. Mass.:
54026.92
Organism:
Homo sapiens (Human)
Description:
P47871
Residue:
477
  
Inhibitor
Name:
BDBM50199490
Synonyms:
3-(1-(3-(3,5-bis(trifluoromethyl)phenyl)-1-((1r,4r)-4-tert-butylcyclohexyl)ureido)-2,3-dihydro-1H-indene-5-carboxamido)propanoic acid | CHEMBL411833
Type:
Small organic molecule
Emp. Form.:
C32H37F6N3O4
Mol. Mass.:
641.6443
SMILES:
CC(C)(C)[C@H]1CC[C@@H](CC1)N(C1CCc2cc(ccc12)C(=O)NCCC(O)=O)C(=O)Nc1cc(cc(c1)C(F)(F)F)C(F)(F)F
: