Target
Gastric inhibitory polypeptide receptor
Ligand
BDBM50199503
Substrate
Meas. Tech.
ChEMBL_441040 (CHEMBL890127)
IC50
610±n/a nM
Citation
 Liang, RAbrardo, LBrady, EJCandelore, MRDing, VSaperstein, RTota, LMWright, MMock, STamvakopolous, CTong, SZheng, SZhang, BBTata, JRParmee, ER Design and synthesis of conformationally constrained tri-substituted ureas as potent antagonists of the human glucagon receptor. Bioorg Med Chem Lett 17:587-92 (2007)  
Target
Name:
Gastric inhibitory polypeptide receptor
Synonyms:
GIPR Gastric Inhibitory Polypeptide Receptor (GIPR) | Gastric inhibitory polypeptide receptor
Type:
PROTEIN
Mol. Mass.:
53173.82
Organism:
Homo sapiens (Human)
Description:
ChEMBL_1518286
Residue:
466
  
Inhibitor
Name:
BDBM50199503
Synonyms:
1-(N-((1r,4r)-4-tert-butylcyclohexyl)-4-(trifluoromethoxy)benzamido)-N-(2H-tetrazol-5-yl)-2,3-dihydro-1H-indene-5-carboxamide | CHEMBL232037
Type:
Small organic molecule
Emp. Form.:
C29H33F3N6O3
Mol. Mass.:
570.6059
SMILES:
CC(C)(C)[C@H]1CC[C@@H](CC1)N(C1CCc2cc(ccc12)C(=O)Nc1nnn[nH]1)C(=O)c1ccc(OC(F)(F)F)cc1
: