Target
5-hydroxytryptamine receptor 1B
Ligand
BDBM50199561
Substrate
Meas. Tech.
ChEMBL_432902 (CHEMBL915028)
Ki
292±n/a nM
Citation
 Horchler, CLMcCauley, JPHall, JESnyder, DHCraig Moore, WHudzik, TJChapdelaine, MJ Synthesis of novel quinolone and quinoline-2-carboxylic acid (4-morpholin-4-yl-phenyl)amides: a late-stage diversification approach to potent 5HT1B antagonists. Bioorg Med Chem 15:939-50 (2006)  
Target
Name:
5-hydroxytryptamine receptor 1B
Synonyms:
5-HT-1B 5-HT1B 5HT1B_HUMAN HTR1DB Serotonin (5-HT) receptor Serotonin Receptor 1B
Type:
G Protein-Coupled Receptor (GPCR)
Mol. Mass.:
43579.17
Organism:
Homo sapiens (Human)
Description:
Receptor binding assays were performed using human clone stably expressed in CHO cells
Residue:
390
  
Inhibitor
Name:
BDBM50199561
Synonyms:
8-[(3-dimethylamino-propyl)-methyl-amino]-6-methoxy-4-oxo-1,4-dihydroquinoline-2-carboxylic acid(4-morpholin-4-yl-phenyl)amide | CHEMBL224738
Type:
Small organic molecule
Emp. Form.:
C27H35N5O4
Mol. Mass.:
493.5979
SMILES:
COc1cc(N(C)CCCN(C)C)c2nc(cc(O)c2c1)C(=O)Nc1ccc(cc1)N1CCOCC1
: