Target
5-hydroxytryptamine receptor 1B
Ligand
BDBM50199562
Substrate
Meas. Tech.
ChEMBL_432902 (CHEMBL915028)
Ki
170±n/a nM
Citation
 Horchler, CLMcCauley, JPHall, JESnyder, DHCraig Moore, WHudzik, TJChapdelaine, MJ Synthesis of novel quinolone and quinoline-2-carboxylic acid (4-morpholin-4-yl-phenyl)amides: a late-stage diversification approach to potent 5HT1B antagonists. Bioorg Med Chem 15:939-50 (2006)  
Target
Name:
5-hydroxytryptamine receptor 1B
Synonyms:
5-HT-1B 5-HT1B 5HT1B_HUMAN HTR1DB Serotonin (5-HT) receptor Serotonin Receptor 1B
Type:
G Protein-Coupled Receptor (GPCR)
Mol. Mass.:
43579.17
Organism:
Homo sapiens (Human)
Description:
Receptor binding assays were performed using human clone stably expressed in CHO cells
Residue:
390
  
Inhibitor
Name:
BDBM50199562
Synonyms:
8-[ethyl-(1-ethyl-pyrrolidin-3-yl)-amino]-6-methoxy-4-oxo-1,4-dihydroquinoline-2-carboxylic acid (4-morpholin-4-yl-phenyl)amide | CHEMBL225310
Type:
Small organic molecule
Emp. Form.:
C29H37N5O4
Mol. Mass.:
519.6352
SMILES:
CCN(C1CCN(CC)C1)c1cc(OC)cc2c(O)cc(nc12)C(=O)Nc1ccc(cc1)N1CCOCC1
: