Target
Histamine H3 receptor
Ligand
BDBM50199597
Substrate
Meas. Tech.
ChEMBL_453434 (CHEMBL885433)
Ki
11±n/a nM
Citation
 Letavic, MAKeith, JMJablonowski, JAStocking, EMGomez, LALy, KSMiller, JMBarbier, AJBonaventure, PBoggs, JDWilson, SJMiller, KLLord, BMcAllister, HMTognarelli, DJWu, JAbad, MCSchubert, CLovenberg, TWCarruthers, NI Novel tetrahydroisoquinolines are histamine H3 antagonists and serotonin reuptake inhibitors. Bioorg Med Chem Lett 17:1047-51 (2007)  
Target
Name:
Histamine H3 receptor
Synonyms:
G-protein coupled receptor 97 HH3R HRH3 Histamine H3 receptor (H3) Histamine receptor (H3 and H4)
Type:
G Protein-Coupled Receptor (GPCR)
Mol. Mass.:
48691.47
Organism:
Homo sapiens (Human)
Description:
Binding assays were using CHO cells stably expressing hH3R receptors.
Residue:
445
  
Inhibitor
Name:
BDBM50199597
Synonyms:
2-methyl-4-(4-(methylthio)phenyl)-7-(3-morpholinopropoxy)-1,2,3,4-tetrahydroisoquinoline | CHEMBL246955
Type:
Small organic molecule
Emp. Form.:
C24H32N2O2S
Mol. Mass.:
412.588
SMILES:
CSc1ccc(cc1)C1CN(C)Cc2cc(OCCCN3CCOCC3)ccc12
: