Target
Sodium-dependent serotonin transporter
Ligand
BDBM50126814
Substrate
Meas. Tech.
ChEMBL_458902 (CHEMBL923873)
Ki
442±n/a nM
Citation
 Gilbert, KMBoos, TLDersch, CMGreiner, EJacobson, AELewis, DMatecka, DPrisinzano, TEZhang, YRothman, RBRice, KCVenanzi, CA DAT/SERT selectivity of flexible GBR 12909 analogs modeled using 3D-QSAR methods. Bioorg Med Chem 15:1146-59 (2006)  
Target
Name:
Sodium-dependent serotonin transporter
Synonyms:
5-HT Transporter 5HT transporter Anandamid membrane transporter, AMT Monoamine transporters; Norepinephrine & serotonin Slc6a4 Sodium-dependent serotonin transporter (SERT) | imipramine receptor
Type:
Multi-pass membrane protein
Mol. Mass.:
70168.43
Organism:
Rattus norvegicus (rat)
Description:
P31652
Residue:
630
  
Inhibitor
Name:
BDBM50126814
Synonyms:
1-(4-(trifluoromethyl)benzyl)-4-(2-(bis(4-fluorophenyl)methoxy)ethyl)piperidine CHEMBL35122
Type:
Small organic molecule
Emp. Form.:
C28H28F5NO
Mol. Mass.:
489.52
SMILES:
Fc1ccc(cc1)C(OCCC1CCN(Cc2ccc(cc2)C(F)(F)F)CC1)c1ccc(F)cc1
: