Target
4-aminobutyrate aminotransferase, mitochondrial
Ligand
BDBM50199989
Substrate
Meas. Tech.
ChEMBL_422533 (CHEMBL911040)
Ki
4200000±n/a nM
Citation
 Lu, HSilverman, RB Fluorinated conformationally restricted gamma-aminobutyric acid aminotransferase inhibitors. J Med Chem 49:7404-12 (2006)  
Target
Name:
4-aminobutyrate aminotransferase, mitochondrial
Synonyms:
(S)-3-amino-2-methylpropionate transaminase 2.6.1.22 ABAT GABA transaminase GABA-T GABT_PIG L-AIBAT
Type:
Mol. Mass.:
56633.06
Organism:
Sus scrofa
Description:
Residue:
500
  
Inhibitor
Name:
BDBM50199989
Synonyms:
(1S,3S)-3-amino-4-(2,2,2-trifluoro-1-trifluoromethylethylidene)cyclopentane | CHEMBL220453
Type:
Small organic molecule
Emp. Form.:
C9H9F6NO2
Mol. Mass.:
277.1637
SMILES:
[#7]-[#6@H]1-[#6]-[#6@H](-[#6]\[#6]-1=[#6](\C(F)(F)F)C(F)(F)F)-[#6](-[#8])=O
: