Target
Prolyl endopeptidase FAP
Ligand
BDBM50200728
Substrate
Meas. Tech.
ChEMBL_422120 (CHEMBL908234)
Ki
94±n/a nM
Citation
 Tran, TQuan, CEdosada, CYMayeda, MWiesmann, CSutherlin, DWolf, BB Synthesis and structure-activity relationship of N-acyl-Gly-, N-acyl-Sar- and N-blocked-boroPro inhibitors of FAP, DPP4, and POP. Bioorg Med Chem Lett 17:1438-42 (2007)  
Target
Name:
Prolyl endopeptidase FAP
Synonyms:
170 kDa melanoma membrane-bound gelatinase Fibroblast Activation Protein (FAP) Integral membrane serine protease Seprase
Type:
Enzyme
Mol. Mass.:
87712.48
Organism:
Homo sapiens (Human)
Description:
Q12884
Residue:
760
  
Inhibitor
Name:
BDBM50200728
Synonyms:
(R)-1-(4-oxo-4-phenylbutanoyl)pyrrolidin-2-ylboronic acid | CHEMBL217802
Type:
Small organic molecule
Emp. Form.:
C14H18BNO4
Mol. Mass.:
275.108
SMILES:
OB(O)[C@@H]1CCCN1C(=O)CCC(=O)c1ccccc1
: