Target
Prolyl endopeptidase FAP
Ligand
BDBM50200733
Substrate
Meas. Tech.
ChEMBL_422120 (CHEMBL908234)
Ki
265±n/a nM
Citation
 Tran, TQuan, CEdosada, CYMayeda, MWiesmann, CSutherlin, DWolf, BB Synthesis and structure-activity relationship of N-acyl-Gly-, N-acyl-Sar- and N-blocked-boroPro inhibitors of FAP, DPP4, and POP. Bioorg Med Chem Lett 17:1438-42 (2007)  
Target
Name:
Prolyl endopeptidase FAP
Synonyms:
170 kDa melanoma membrane-bound gelatinase Fibroblast Activation Protein (FAP) Integral membrane serine protease Seprase
Type:
Enzyme
Mol. Mass.:
87712.48
Organism:
Homo sapiens (Human)
Description:
Q12884
Residue:
760
  
Inhibitor
Name:
BDBM50200733
Synonyms:
(R)-1-(2-(N-methylisobutyramido)acetyl)pyrrolidin-2-ylboronic acid | CHEMBL216376
Type:
Small organic molecule
Emp. Form.:
C11H21BN2O4
Mol. Mass.:
256.106
SMILES:
CC(C)C(=O)N(C)CC(=O)N1CCC[C@H]1B(O)O
: