Target
Prolyl endopeptidase
Ligand
BDBM50200731
Substrate
Meas. Tech.
ChEMBL_422119 (CHEMBL908233)
Ki
353±n/a nM
Citation
 Tran, TQuan, CEdosada, CYMayeda, MWiesmann, CSutherlin, DWolf, BB Synthesis and structure-activity relationship of N-acyl-Gly-, N-acyl-Sar- and N-blocked-boroPro inhibitors of FAP, DPP4, and POP. Bioorg Med Chem Lett 17:1438-42 (2007)  
Target
Name:
Prolyl endopeptidase
Synonyms:
PE POP PREP Prolyl oligopeptidase
Type:
Enzyme
Mol. Mass.:
80688.50
Organism:
Homo sapiens (Human)
Description:
P48147
Residue:
710
  
Inhibitor
Name:
BDBM50200731
Synonyms:
(R)-1-(2-(2-oxopyridin-1(2H)-yl)acetyl)pyrrolidin-2-ylboronic acid | CHEMBL383855
Type:
Small organic molecule
Emp. Form.:
C11H15BN2O4
Mol. Mass.:
250.059
SMILES:
OB(O)[C@@H]1CCCN1C(=O)Cn1ccccc1=O
: