Target
Prolyl endopeptidase
Ligand
BDBM50200732
Substrate
Meas. Tech.
ChEMBL_422119 (CHEMBL908233)
Ki
4.5±n/a nM
Citation
 Tran, TQuan, CEdosada, CYMayeda, MWiesmann, CSutherlin, DWolf, BB Synthesis and structure-activity relationship of N-acyl-Gly-, N-acyl-Sar- and N-blocked-boroPro inhibitors of FAP, DPP4, and POP. Bioorg Med Chem Lett 17:1438-42 (2007)  
Target
Name:
Prolyl endopeptidase
Synonyms:
PE POP PREP Prolyl oligopeptidase
Type:
Enzyme
Mol. Mass.:
80688.50
Organism:
Homo sapiens (Human)
Description:
P48147
Residue:
710
  
Inhibitor
Name:
BDBM50200732
Synonyms:
(R)-1-(2-isobutyramidoacetyl)pyrrolidin-2-ylboronic acid | CHEMBL216410
Type:
Small organic molecule
Emp. Form.:
C10H19BN2O4
Mol. Mass.:
242.08
SMILES:
CC(C)C(=O)NCC(=O)N1CCC[C@H]1B(O)O
: