Target
Acetylcholinesterase
Ligand
BDBM29398
Substrate
Meas. Tech.
ChEMBL_422675 (CHEMBL913361)
IC50
160±n/a nM
Citation
 Marco-Contelles, JLeón, Rde Los Ríos, CGuglietta, ATerencio, JLópez, MGGarcía, AGVillarroya, M Novel multipotent tacrine-dihydropyridine hybrids with improved acetylcholinesterase inhibitory and neuroprotective activities as potential drugs for the treatment of Alzheimer's disease. J Med Chem 49:7607-10 (2006)  
Target
Name:
Acetylcholinesterase
Synonyms:
ACES_ELEEL Acetylcholinesterase (EeAChE) | ache
Type:
Enzyme
Mol. Mass.:
71812.79
Organism:
Electrophorus electricus (Electric eel)
Description:
Residue:
633
  
Inhibitor
Name:
BDBM29398
Synonyms:
CHEMBL436302 | tacrine-dihydropyridine hybrid (tacripyrine), 9
Type:
Small organic molecule
Emp. Form.:
C23H27N3O3
Mol. Mass.:
393.4788
SMILES:
CCOC(=O)C1C(c2ccccc2OC)c2c(N)c3CCCCc3nc2N=C1C
: