Target
Acetylcholinesterase
Ligand
BDBM29398
Substrate
Meas. Tech.
ChEMBL_422676 (CHEMBL913362)
IC50
234±n/a nM
Citation
 Marco-Contelles, JLeón, Rde Los Ríos, CGuglietta, ATerencio, JLópez, MGGarcía, AGVillarroya, M Novel multipotent tacrine-dihydropyridine hybrids with improved acetylcholinesterase inhibitory and neuroprotective activities as potential drugs for the treatment of Alzheimer's disease. J Med Chem 49:7607-10 (2006)  
Target
Name:
Acetylcholinesterase
Synonyms:
ACES_HUMAN Acetylcholinesterase (AChE) | Acetylcholinesterase (human AChE)
Type:
Enzyme
Mol. Mass.:
67792.70
Organism:
Homo sapiens (Human)
Description:
P22303
Residue:
614
  
Inhibitor
Name:
BDBM29398
Synonyms:
CHEMBL436302 | tacrine-dihydropyridine hybrid (tacripyrine), 9
Type:
Small organic molecule
Emp. Form.:
C23H27N3O3
Mol. Mass.:
393.4788
SMILES:
CCOC(=O)C1C(c2ccccc2OC)c2c(N)c3CCCCc3nc2N=C1C
: