Target
Caspase-3
Ligand
BDBM50200932
Substrate
Meas. Tech.
ChEMBL_423899 (CHEMBL913573)
Ki
840±n/a nM
Citation
 Henzing, AJDodson, HReid, JMKaufmann, SHBaxter, RLEarnshaw, WC Synthesis of novel caspase inhibitors for characterization of the active caspase proteome in vitro and in vivo. J Med Chem 49:7636-45 (2006)  
Target
Name:
Caspase-3
Synonyms:
Apopain CASP3 CPP-32 Caspase 3 Caspase-3 subunit p17 SCA-1 Yama protein | caspase-3 preproprotein
Type:
Hydrolase; heterotetramer of two heterodimers
Mol. Mass.:
31607.55
Organism:
Homo sapiens (Human)
Description:
Residue:
277
  
Inhibitor
Name:
BDBM50200932
Synonyms:
(3S)-3-[(2S)-6-(6-{5-[(3aS,6aR)-2-oxo-hexahydro-1H-thieno[3,4-d]imidazolidin-4-yl]pentanamido}hexanamido)-2-[(2S)-2-{[(benzyloxy)carbonyl]amino}-4-carboxybutanamido]hexanamido]-5-[(2,6-dimethylphenyl)carbonyloxy]-4-oxopentanoic acid | CHEMBL221870
Type:
Small organic molecule
Emp. Form.:
C49H67N7O14S
Mol. Mass.:
1010.16
SMILES:
Cc1cccc(C)c1C(=O)OCC(=O)[C@H](CC(O)=O)NC(=O)[C@H](CCCCNC(=O)CCCCCNC(=O)CCCCC1SC[C@@H]2NC(=O)N[C@H]12)NC(=O)[C@H](CCC(O)=O)NC(=O)OCc1ccccc1
: