Target
Deoxynucleoside kinase
Ligand
BDBM50200993
Substrate
Meas. Tech.
ChEMBL_422918 (CHEMBL908770)
IC50
21000±n/a nM
Citation
 Hernandez, AIFamiliar, ONegri, ARodríguez-Barrios, FGago, FKarlsson, ACamarasa, MJBalzarini, JPérez-Pérez, MJ N1-substituted thymine derivatives as mitochondrial thymidine kinase (TK-2) inhibitors. J Med Chem 49:7766-73 (2006)  
Target
Name:
Deoxynucleoside kinase
Synonyms:
DNK_DROME Dm-dNK dnk
Type:
PROTEIN
Mol. Mass.:
29092.93
Organism:
Drosophila melanogaster
Description:
ChEMBL_627484
Residue:
250
  
Inhibitor
Name:
BDBM50200993
Synonyms:
1-[3-(triphenylmethoxy)propyl]thymine | CHEMBL384435
Type:
Small organic molecule
Emp. Form.:
C27H26N2O3
Mol. Mass.:
426.5069
SMILES:
Cc1cn(CCCOC(c2ccccc2)(c2ccccc2)c2ccccc2)c(=O)[nH]c1=O
: