Target
Thymidine phosphorylase
Ligand
BDBM50201013
Substrate
Meas. Tech.
ChEMBL_422808 (CHEMBL856524)
Ki
1050±n/a nM
Citation
 Allan, ALGladstone, PLPrice, MLHopkins, SAJuarez, JCDoñate, FTernansky, RJShaw, DEGanem, BLi, YWang, WEalick, S Synthesis and evaluation of multisubstrate bicyclic pyrimidine nucleoside inhibitors of human thymidine phosphorylase. J Med Chem 49:7807-15 (2006)  
Target
Name:
Thymidine phosphorylase
Synonyms:
ECGF1 PD-ECGF TP TYPH_HUMAN Thymidine Phosphorylase (TP) | Thymidine phosphorylase
Type:
Enzyme
Mol. Mass.:
49948.87
Organism:
Homo sapiens (Human)
Description:
The recombinant human thymidine phosphorylase (V79TP) was expressed in V79 Chinese hamster cells (Sigma, T-9319).
Residue:
482
  
Inhibitor
Name:
BDBM50201013
Synonyms:
((2S,3aR,4S,6R,6aR)-4-(hydroxymethyl)-6-(5-methyl-2,4-dioxo-3,4-dihydropyrimidin-1(2H)-yl)-hexahydrofuro[3,4-b]furan-2-yl)methylphosphonic acid CHEMBL373989
Type:
Small organic molecule
Emp. Form.:
C13H19N2O8P
Mol. Mass.:
362.2723
SMILES:
Cc1cn([C@@H]2O[C@H](CO)[C@H]3C[C@@H](CP(O)(O)=O)O[C@@H]23)c(=O)[nH]c1=O
: