Target
Muscarinic acetylcholine receptor M1
Ligand
BDBM50201278
Substrate
Meas. Tech.
ChEMBL_441416 (CHEMBL891645)
Ki
380±n/a nM
Citation
 Sonda, SKatayama, KFujio, MSakashita, HInaba, KAsano, KAkira, T 1,5-Benzodioxepin derivatives as a novel class of muscarinic M3 receptor antagonists. Bioorg Med Chem Lett 17:925-31 (2007)  
Target
Name:
Muscarinic acetylcholine receptor M1
Synonyms:
ACM1_HUMAN Cholinergic receptor, muscarinic 1 | Cholinergic, muscarinic M1
Type:
Protein
Mol. Mass.:
51442.54
Organism:
Homo sapiens (Human)
Description:
P11229
Residue:
460
  
Inhibitor
Name:
BDBM50201278
Synonyms:
3-((2-fluorophenethylamino)methyl)-N,N-dimethyl-3,4-dihydro-2H-benzo[b][1,4]dioxepin-3-amine | CHEMBL233200
Type:
Small organic molecule
Emp. Form.:
C20H25FN2O2
Mol. Mass.:
344.4231
SMILES:
CN(C)C1(CNCCc2ccccc2F)COc2ccccc2OC1
: