Target
Muscarinic acetylcholine receptor M3
Ligand
BDBM50201288
Substrate
Meas. Tech.
ChEMBL_441418 (CHEMBL891647)
IC50
>100±n/a nM
Citation
 Sonda, SKatayama, KFujio, MSakashita, HInaba, KAsano, KAkira, T 1,5-Benzodioxepin derivatives as a novel class of muscarinic M3 receptor antagonists. Bioorg Med Chem Lett 17:925-31 (2007)  
Target
Name:
Muscarinic acetylcholine receptor M3
Synonyms:
ACM3_HUMAN Cholinergic, muscarinic M3 Muscarinic receptor M3 | RecName: Full=Muscarinic acetylcholine receptor M3
Type:
Enzyme
Mol. Mass.:
66151.03
Organism:
Homo sapiens (Human)
Description:
P20309
Residue:
590
  
Inhibitor
Name:
BDBM50201288
Synonyms:
3-((4-methoxyphenethylamino)methyl)-N,N-dimethyl-3,4-dihydro-2H-benzo[b][1,4]dioxepin-3-amine | CHEMBL429620
Type:
Small organic molecule
Emp. Form.:
C21H28N2O3
Mol. Mass.:
356.4586
SMILES:
COc1ccc(CCNCC2(COc3ccccc3OC2)N(C)C)cc1
: