Target
Muscarinic acetylcholine receptor M2
Ligand
BDBM50201285
Substrate
Meas. Tech.
ChEMBL_441417 (CHEMBL891646)
Ki
2±n/a nM
Citation
 Sonda, SKatayama, KFujio, MSakashita, HInaba, KAsano, KAkira, T 1,5-Benzodioxepin derivatives as a novel class of muscarinic M3 receptor antagonists. Bioorg Med Chem Lett 17:925-31 (2007)  
Target
Name:
Muscarinic acetylcholine receptor M2
Synonyms:
ACM2_HUMAN Cholinergic, muscarinic M2 Muscarinic acetylcholine receptor M2 and M5 | RecName: Full=Muscarinic acetylcholine receptor M2
Type:
GPCR
Mol. Mass.:
51730.61
Organism:
Homo sapiens (Human)
Description:
P08172
Residue:
466
  
Inhibitor
Name:
BDBM50201285
Synonyms:
3-((2-cycloheptylethylamino)methyl)-N,N-dimethyl-3,4-dihydro-2H-benzo[b][1,4]dioxepin-3-amine | CHEMBL234439
Type:
Small organic molecule
Emp. Form.:
C21H34N2O2
Mol. Mass.:
346.5069
SMILES:
CN(C)C1(CNCCC2CCCCCC2)COc2ccccc2OC1
: