Target
Vascular endothelial growth factor receptor 2
Ligand
BDBM50201329
Substrate
Meas. Tech.
ChEMBL_438153 (CHEMBL907546)
IC50
491±n/a nM
Citation
 Heyman, HRFrey, RRBousquet, PFCunha, GAMoskey, MDAhmed, AASoni, NBMarcotte, PAPease, LJGlaser, KBYates, MBouska, JJAlbert, DHBlack-Schaefer, CLDandliker, PJStewart, KDRafferty, PDavidsen, SKMichaelides, MRCurtin, ML Thienopyridine urea inhibitors of KDR kinase. Bioorg Med Chem Lett 17:1246-9 (2007)  
Target
Name:
Vascular endothelial growth factor receptor 2
Synonyms:
CD_antigen=CD309 Fetal liver kinase 1 (FLK-1) KDR Protein-tyrosine kinase receptor Flk-1 VEGFR-2 VEGFR2 Vascular Endothelial Growth Factor Receptor Kinase 2 Vascular endothelial growth factor receptor 2 (KDR) Vascular endothelial growth factor receptor 2 (VEGFR2) Vascular endothelial growth factor receptor-2 (VEGFR-2)
Type:
Receptor Tyrosine Kinase
Mol. Mass.:
151510.97
Organism:
Homo sapiens (Human)
Description:
P35968
Residue:
1356
  
Inhibitor
Name:
BDBM50201329
Synonyms:
1-(4-(4-aminothieno[3,2-c]pyridin-3-yl)phenyl)-3-cyclohexylurea | CHEMBL231415
Type:
Small organic molecule
Emp. Form.:
C20H22N4OS
Mol. Mass.:
366.48
SMILES:
Nc1nccc2scc(-c3ccc(NC(=O)NC4CCCCC4)cc3)c12
: