Target
Carboxypeptidase B2
Ligand
BDBM50201430
Substrate
Meas. Tech.
ChEMBL_453904 (CHEMBL885908)
IC50
905±n/a nM
Citation
 Islam, IBryant, JMay, KMohan, RYuan, SKent, LMorser, JZhao, LVergona, RWhite, KAdler, MWhitlow, MBuckman, BO 3-Mercaptopropionic acids as efficacious inhibitors of activated thrombin activatable fibrinolysis inhibitor (TAFIa). Bioorg Med Chem Lett 17:1349-54 (2007)  
Target
Name:
Carboxypeptidase B2
Synonyms:
CBPB2_HUMAN CPU Carboxypeptidase B2 isoform A Plasma carboxypeptidase B Thrombin-activable fibrinolysis inhibitor | pCPB
Type:
Enzyme
Mol. Mass.:
48432.74
Organism:
Homo sapiens (Human)
Description:
Q96IY4
Residue:
423
  
Inhibitor
Name:
BDBM50201430
Synonyms:
2-(4-carbamimidoylphenyl)-3-mercaptopropanoic acid | CHEMBL394951
Type:
Small organic molecule
Emp. Form.:
C10H12N2O2S
Mol. Mass.:
224.279
SMILES:
NC(=N)c1ccc(cc1)C(CS)C(O)=O
: