Target
Dipeptidyl peptidase 4
Ligand
BDBM11710
Substrate
Meas. Tech.
ChEMBL_422033 (CHEMBL908237)
IC50
119±n/a nM
Citation
 Coumar, MSChang, CNChen, CTChen, XChien, CHTsai, TYCheng, JHWu, HYHan, CHWu, SHHuang, YWHsu, THsu, LJChao, YSHsieh, HPJiaang, WT 3-[2-((2S)-2-cyano-pyrrolidin-1-yl)-2-oxo-ethylamino]-3-methyl-butyramide analogues as selective DPP-IV inhibitors for the treatment of type-II diabetes. Bioorg Med Chem Lett 17:1274-9 (2007)  
Target
Name:
Dipeptidyl peptidase 4
Synonyms:
ADABP Adenosine deaminase complexing protein 2 CD_antigen=CD26 DPP4 DPPIV Dipeptidyl peptidase 4 (DPP IV) Dipeptidyl peptidase 4 (DPP4) Dipeptidyl peptidase 4 membrane form Dipeptidyl peptidase IV Dipeptidyl peptidase IV (DDP-IV) Dipeptidyl peptidase IV membrane form Dipeptidyl peptidase-IV (DPP-4) T-cell activation antigen CD26 | TP103
Type:
Enzyme
Mol. Mass.:
88271.01
Organism:
Homo sapiens (Human)
Description:
P27487
Residue:
766
  
Inhibitor
Name:
BDBM11710
Synonyms:
(2S)-Cyanopyrrolidine analogue 18n 3-[2-(2-Cyano-(S)-pyrrolidin-1-yl)-2-oxoethylamino]-N-(1-methyl-1-phenylethyl)propionamide | CHEMBL201158
Type:
Small organic molecule
Emp. Form.:
C19H26N4O2
Mol. Mass.:
342.4353
SMILES:
CC(C)(NC(=O)CCNCC(=O)N1CCC[C@H]1C#N)c1ccccc1
: